[OpenAFS] Afs on Sparc-Linux

flow flow@swissonline.ch
Wed, 25 Apr 2001 12:27:17 +0100

Hi, I am compiling the openafs-source on a Sun Ultra1 running on
SuSE-Linux with Kernel 2.2.18. When compiling I get the  following
errormessages. Has anyone a solution?

   /usr/include/bits/sigstack.h:27: redefinition of `struct sigstack'
/usr/include/bits/sigstack.h:36: parse error before `1'
/usr/include/bits/sigstack.h:51: redefinition of `struct sigaltstack'
/usr/include/bits/sigstack.h:55: warning: redefinition of `stack_t'
/usr/src/linux-2.2.18/include/asm/signal.h:245: warning: `stack_t'
previously declared here
make[3]: *** [kdump.o] Error 1
make[3]: Leaving directory
make[2]: *** [venus] Error 2
make[2]: Leaving directory `/usr/local/afs/openafs-1.0.3'
make[1]: *** [install] Error 2
make[1]: Leaving directory `/usr/local/afs/openafs-1.0.3'
make: *** [all] Error 2


Bjoern Erik Abt