[OpenAFS] "package" won't build 1.4.1-rc2

Andrew Bacchi bacchi@rpi.edu
04 Jan 2006 12:02:18 -0500

OK, I know this is very old technology, but we still use 'package' for
WS updates.

Here is the compile error, I've looked through the package files, but I
can't tell which value is void that shouldn't be.  This built fine in
1.2.13.  Thanks.

package.c: In function `packageExecute':
package.c:149: error: void value not ignored as it ought to be
make[3]: *** [package.o] Error 1
make[3]: Leaving directory
make[2]: *** [package] Error 2
make[2]: Leaving directory `/usr/src/redhat/BUILD/openafs-1.4.1-rc2'
make[1]: *** [build] Error 2
make[1]: Leaving directory `/usr/src/redhat/BUILD/openafs-1.4.1-rc2'
make: *** [all_nolibafs] Error 2
+ exit 1

veritatis simplex oratio est

Andrew Bacchi
Staff Systems Programmer
Rensselaer Polytechnic Institute
phone: 518 276-6415  fax: 518 276-2809